{"text_format":"1","workbook":"xlsx","n_sheets":10,"sheets":["Startpagina-Handleiding","Bijlage3_Aanvraag","Bijlage3_Opstartbeslissing","Bijlage3_Globale Evaluatie","Doc Load_Aanvraag","Doc Load_Evaluatie 2","Doc Load_Evaluatie 3","Upload AXI - CONF","Upload AXI","Bron"],"not_rendered":{"charts":0,"images":4,"macros":1,"external_links":2,"defined_names":26,"comments":0,"pivot_tables":0},"unopened":[],"bounds":{"document_bytes":16777216,"sheet_cells":100000,"rows_first":2000,"rows_last":500,"rows_between":2000,"halvings":0,"cell_chars":16384,"cell_head_chars":4096},"cells_cut":0,"cells_raw":0,"read":"whole","date_system":"1900"}

{"sheet":"Startpagina-Handleiding","index":0,"n_rows":20,"n_cols":10,"rows_kept":20,"cut":false,"hidden":false,"merged":[[1,0,1,21],[17,0,17,20],[14,0,14,20],[15,0,15,3],[18,0,18,3],[7,0,7,4],[8,6,9,7],[9,0,9,4],[3,0,3,13],[4,0,4,4],[5,0,5,4],[6,0,6,4],[4,7,4,8],[4,9,4,10],[5,9,6,13],[19,0,19,19],[10,0,10,21],[12,0,12,21],[13,0,13,24],[16,0,16,20],[11,0,11,24]]}
[]
["Aanvinklijst VIPA-criteria duurzaamheid voor het project waarvoor VIPA-subsidie worden aangevraagd"]
[]
["Vlaams Infrastructuurfonds voor Persoonsgebonden Aangelegenheden (VIPA)"]
["Ellipsgebouw",null,null,null,null,null,null,"Dossier nummer"]
["Koning Albert II-laan 35 bus 34, 1030 BRUSSEL",null,null,null,null,null,null,null,null,"Het dossier nummer dient ingevuld te worden door de bevoegde instantie."]
["Tel. 02 553 32 41 – Fax 02 553 34 80"]
["E-mail: vipa@vlaanderen.be"]
[]
["Waarvoor dient dit document?"]
{"$rows_left_out":11}
{"sheet":"Bijlage3_Aanvraag","index":1,"n_rows":255,"n_cols":14,"rows_kept":255,"cut":false,"hidden":false,"merged":[[17,1,17,7],[239,1,239,7],[242,1,242,7],[245,1,245,7],[233,1,233,7],[236,1,236,7]]}
[]
[null,"VIPA criteria duurzaamheid ",null,null,null,null,null,"ZIEKENHUIZEN"]
[]
[null,"Thema","Criterium","Deeleis ","Verplicht / vrij","Minimaal prestatieniveau of voldaan","Criteria project ","Behaald prestatieniveau"]
[]
[null,"DEEL I: BASISPRINCIPES"]
[]
[null,"CON 1: Duurzaam concept"]
[null,null,"CON 1.1","Duurzaam ruimtegebruik: pas de principes van de Trias toponoma toe","Verplicht ","Voldaan",{"$f":"IF(VLOOKUP(C9,'Doc Load_Aanvraag'!$B$49:$C$386,2,FALSE)=TRUE,1, 0)","v":0},{"$f":"IF(VLOOKUP(C9,'Doc Load_Aanvraag'!$B$49:$C$386,2,FALSE)=TRUE,Bron!$B$7,Bron!$B$8)","v":"Niet voldaan"}]
[null,null,"CON 1.2","Pas de principes van climate responsive design en de Penta Energetica toe","Verplicht","Voldaan",{"$f":"IF(VLOOKUP(C10,'Doc Load_Aanvraag'!$B$49:$C$386,2,FALSE)=TRUE,1, 0)","v":0},{"$f":"IF(VLOOKUP(C10,'Doc Load_Aanvraag'!$B$49:$C$386,2,FALSE)=TRUE,Bron!$B$7,Bron!$B$8)","v":"Niet voldaan"}]
{"$rows_left_out":246}
{"sheet":"Bijlage3_Opstartbeslissing","index":2,"n_rows":255,"n_cols":14,"rows_kept":255,"cut":false,"hidden":false,"merged":[[245,1,245,7],[209,2,209,7],[219,2,219,7],[233,1,233,7],[236,1,236,7],[239,1,239,7],[242,1,242,7],[204,2,204,7],[121,2,121,7],[138,2,138,7],[143,2,143,7],[150,2,150,7],[160,2,160,7],[164,2,164,7],[170,2,170,7],[175,2,175,7],[180,2,180,7],[185,2,185,7],[201,2,201,7],[115,2,115,7],[17,1,17,7],[28,2,28,7],[33,2,33,7],[38,2,38,7],[46,2,46,7],[48,2,48,7],[50,2,50,7],[59,2,59,7],[69,2,69,7],[84,2,84,7],[93,2,93,7]]}
[]
[null,"VIPA criteria duurzaamheid ",null,null,null,null,null,"ZIEKENHUIZEN"]
[]
[null,"Thema","Criterium","Deeleis ","Verplicht / vrij","Minimaal prestatieniveau of voldaan","Criteria project ","Behaald prestatieniveau"]
[]
[null,"DEEL I: BASISPRINCIPES"]
[]
[null,"CON 1: Duurzaam concept"]
[null,null,"CON 1.1","Duurzaam ruimtegebruik: pas de principes van de Trias toponoma toe","Verplicht ","Voldaan",{"$f":"IF(VLOOKUP(C9,'Doc Load_Evaluatie 2'!$B$49:$C$386,2,FALSE)=TRUE,1, 0)","v":0},{"$f":"IF(VLOOKUP(C9,'Doc Load_Evaluatie 2'!$B$49:$C$386,2,FALSE)=TRUE,Bron!$B$7,Bron!$B$8)","v":"Niet voldaan"}]
[null,null,"CON 1.2","Pas de principes van climate responsive design en de Penta Energetica toe","Verplicht","Voldaan",{"$f":"IF(VLOOKUP(C10,'Doc Load_Evaluatie 2'!$B$49:$C$386,2,FALSE)=TRUE,1, 0)","v":0},{"$f":"IF(VLOOKUP(C10,'Doc Load_Evaluatie 2'!$B$49:$C$386,2,FALSE)=TRUE,Bron!$B$7,Bron!$B$8)","v":"Niet voldaan"}]
{"$rows_left_out":246}
{"sheet":"Bijlage3_Globale Evaluatie","index":3,"n_rows":255,"n_cols":14,"rows_kept":255,"cut":false,"hidden":false,"merged":[[245,1,245,7],[209,2,209,7],[219,2,219,7],[233,1,233,7],[236,1,236,7],[239,1,239,7],[242,1,242,7],[204,2,204,7],[121,2,121,7],[138,2,138,7],[143,2,143,7],[150,2,150,7],[160,2,160,7],[164,2,164,7],[170,2,170,7],[175,2,175,7],[180,2,180,7],[185,2,185,7],[201,2,201,7],[115,2,115,7],[17,1,17,7],[28,2,28,7],[33,2,33,7],[38,2,38,7],[46,2,46,7],[48,2,48,7],[50,2,50,7],[59,2,59,7],[69,2,69,7],[84,2,84,7],[93,2,93,7]]}
[]
[null,"VIPA criteria duurzaamheid ",null,null,null,null,null,"ZIEKENHUIZEN"]
[]
[null,"Thema","Criterium","Deeleis ","Verplicht / vrij","Minimaal prestatieniveau of voldaan","Criteria project ","Behaald prestatieniveau"]
[]
[null,"DEEL I: BASISPRINCIPES"]
[]
[null,"CON 1: Duurzaam concept"]
[null,null,"CON 1.1","Duurzaam ruimtegebruik: pas de principes van de Trias toponoma toe","Verplicht ","Voldaan",{"$f":"IF(VLOOKUP(C9,'Doc Load_Evaluatie 3'!$B$49:$C$386,2,FALSE)=TRUE,1, 0)","v":0},{"$f":"IF(VLOOKUP(C9,'Doc Load_Aanvraag'!$B$49:$C$386,2,FALSE)=TRUE,Bron!$B$7,Bron!$B$8)","v":"Niet voldaan"}]
[null,null,"CON 1.2","Pas de principes van climate responsive design en de Penta Energetica toe","Verplicht","Voldaan",{"$f":"IF(VLOOKUP(C10,'Doc Load_Evaluatie 3'!$B$49:$C$386,2,FALSE)=TRUE,1, 0)","v":0},{"$f":"IF(VLOOKUP(C10,'Doc Load_Aanvraag'!$B$49:$C$386,2,FALSE)=TRUE,Bron!$B$7,Bron!$B$8)","v":"Niet voldaan"}]
{"$rows_left_out":246}
{"sheet":"Doc Load_Aanvraag","index":4,"n_rows":556,"n_cols":8,"rows_kept":556,"cut":false,"hidden":true,"merged":[]}
[]
[null,"Naam besturingselement WORD","Waarde bestruingselement WORD",null,null,null,"Upload AXI - Veld","Upload AXI - waarde"]
[null,null,false,null,null,null,"MIL 1.3 Uitstekend vla",{"$f":"VLOOKUP(G3,$B$51:$C$645,2,FALSE)","v":false}]
[null,"CON 1.1",true,null,null,null,"MIL 1.3 Beter vla",{"$f":"VLOOKUP(G4,$B$51:$C$645,2,FALSE)","v":false}]
[null,"CON 1.1",false,null,null,null,"MIL 1.3 Goed vla",false]
[null,"CON 1.2",false,null,null,null,"MIL 1.3 Uitstekend bru",false]
[null,"CON 1.3",false,null,null,null,"MIL 1.3 Beter bru",false]
[null,"MA 1.2",false,null,null,null,"MIL 1.3 Goed bru",false]
[null,"MIL 1",false,null,null,null,"MIL 2 Uitstekend",false]
[null,"MIL 2",false,null,null,null,"MIL 2 Beter",false]
{"$rows_left_out":547}
{"sheet":"Doc Load_Evaluatie 2","index":5,"n_rows":556,"n_cols":8,"rows_kept":556,"cut":false,"hidden":true,"merged":[]}
[]
[null,"Naam besturingselement WORD","Waarde bestruingselement WORD",null,null,null,"Upload AXI - Veld","Upload AXI - waarde"]
[null,null,false,null,null,null,"MIL 1.3 Uitstekend vla",{"$f":"VLOOKUP(G3,$B$51:$C$645,2,FALSE)","v":false}]
[null,"CON 1.1",true,null,null,null,"MIL 1.3 Beter vla",{"$f":"VLOOKUP(G4,$B$51:$C$645,2,FALSE)","v":false}]
[null,"CON 1.1",false,null,null,null,"MIL 1.3 Goed vla",false]
[null,"CON 1.2",false,null,null,null,"MIL 1.3 Uitstekend bru",false]
[null,"CON 1.3",false,null,null,null,"MIL 1.3 Beter bru",false]
[null,"MA 1.2",false,null,null,null,"MIL 1.3 Goed bru",false]
[null,"MIL 1",false,null,null,null,"MIL 2 Uitstekend",false]
[null,"MIL 2",false,null,null,null,"MIL 2 Beter",false]
{"$rows_left_out":547}
{"sheet":"Doc Load_Evaluatie 3","index":6,"n_rows":556,"n_cols":8,"rows_kept":556,"cut":false,"hidden":true,"merged":[]}
[]
[null,"Naam besturingselement WORD","Waarde bestruingselement WORD",null,null,null,"Upload AXI - Veld","Upload AXI - waarde"]
[null,null,false,null,null,null,"MIL 1.3 Uitstekend vla",{"$f":"VLOOKUP(G3,$B$51:$C$645,2,FALSE)","v":false}]
[null,"CON 1.1",true,null,null,null,"MIL 1.3 Beter vla",{"$f":"VLOOKUP(G4,$B$51:$C$645,2,FALSE)","v":false}]
[null,"CON 1.1",false,null,null,null,"MIL 1.3 Goed vla",false]
[null,"CON 1.2",false,null,null,null,"MIL 1.3 Uitstekend bru",false]
[null,"CON 1.3",false,null,null,null,"MIL 1.3 Beter bru",false]
[null,"MA 1.2",false,null,null,null,"MIL 1.3 Goed bru",false]
[null,"MIL 1",false,null,null,null,"MIL 2 Uitstekend",false]
[null,"MIL 2",false,null,null,null,"MIL 2 Beter",false]
{"$rows_left_out":547}
{"sheet":"Upload AXI - CONF","index":7,"n_rows":92,"n_cols":7,"rows_kept":92,"cut":false,"hidden":true,"merged":[]}
["Object AXI","Flexfield AXI","Locatie AXI","Cel Excel","Uitleg","Type flexfield","Flextab Axi "]
[null,"Dossier.Reference",{"$f":"_xlfn.CONCAT(A2,B2)","v":"Dossier.Reference"},{"$f":"'Startpagina-Handleiding'!J5","v":0},"Naam project"]
["object.DZAV.Flex","DZ001","object.DZAV.FlexDZ001",{"$f":"Bijlage3_Aanvraag!G251","v":0},"Score verplichte criteria","Geheel getal","object - Duurzaamheid - aanvraag"]
["object.DZAV.Flex","DZ002","object.DZAV.FlexDZ002",{"$f":"Bijlage3_Aanvraag!G250","v":0},"Score Vrije Criteria","Geheel getal","object - Duurzaamheid - aanvraag"]
["object.DZAV.Flex","DZ003","object.DZAV.FlexDZ003",{"$f":"Bijlage3_Aanvraag!G255","v":0},"Totaal score","Geheel getal","object - Duurzaamheid - aanvraag"]
["object.DZAV.Flex","DZ004","object.DZAV.FlexDZ004",{"$f":"IF(OR('Doc Load_Aanvraag'!H3=TRUE,'Doc Load_Aanvraag'!H6=TRUE),\"niet-overstromingsgebied\",IF(OR('Doc Load_Aanvraag'!H4=TRUE,H7=TRUE),\"mogelijk overstromingsgebied\",IF(OR('Doc Load_Aanvraag'!H5=TRUE,'Doc Load_Aanvraag'!H8=TRUE),\"effectief overstromingsgebied\",\"\")))","v":""},"MIL 1: Overstromingsrisico","tekstveld","object - Duurzaamheid - aanvraag"]
["object.DZAV.Flex","DZ005","object.DZAV.FlexDZ005",{"$f":"IF('Doc Load_Aanvraag'!H11=TRUE,\"≤ 40 μg/m3\",IF('Doc Load_Aanvraag'!H10=TRUE,\"≤ 30 μg/m3\",IF('Doc Load_Aanvraag'!H9=TRUE,\"≤ 20 μg/m3\",\"\")))","v":""},"MIL 2 : Stikstofconcentratie NO2 ","tekstveld","object - Duurzaamheid - aanvraag"]
["object.DZAV.Flex","DZ013","object.DZAV.FlexDZ013",{"$f":"IF('Doc Load_Aanvraag'!H21=TRUE,\"optie 1\",IF('Doc Load_Aanvraag'!H23=TRUE,\"optie 2\",\"\"))","v":""},"BIN 2.1 : zomercomfort optie","tekstveld","object - Duurzaamheid - aanvraag"]
["object.DZAV.Flex","DZ014","object.DZAV.FlexDZ014",{"$f":"IF('Doc Load_Aanvraag'!H19=TRUE,\"Adaptief\",IF('Doc Load_Aanvraag'!H20=TRUE,\"Niet-adaptief\",\"\"))","v":""},"BIN 2.1 : zomercomfort adaptief/ niet adaptief","tekstveld","object - Duurzaamheid - aanvraag"]
["object.DZAV.Flex","DZ015","object.DZAV.FlexDZ015",{"$f":"IF('Doc Load_Aanvraag'!H21=TRUE,'Doc Load_Aanvraag'!H22,IF('Doc Load_Aanvraag'!H23=TRUE,'Doc Load_Aanvraag'!H24,\"\"))","v":""},"BIN 2.1 : zomercomfort zonwering","tekstveld","object - Duurzaamheid - aanvraag"]
{"$rows_left_out":83}
{"sheet":"Upload AXI","index":8,"n_rows":2,"n_cols":130,"rows_kept":2,"cut":false,"hidden":true,"merged":[]}
[{"$f":"'Upload AXI - CONF'!C2","v":"Dossier.Reference"},{"$f":"'Upload AXI - CONF'!C3","v":"object.DZAV.FlexDZ001"},{"$f":"'Upload AXI - CONF'!C4","v":"object.DZAV.FlexDZ002"},{"$f":"'Upload AXI - CONF'!C5","v":"object.DZAV.FlexDZ003"},{"$f":"'Upload AXI - CONF'!C6","v":"object.DZAV.FlexDZ004"},{"$f":"'Upload AXI - CONF'!C7","v":"object.DZAV.FlexDZ005"},{"$f":"'Upload AXI - CONF'!C8","v":"object.DZAV.FlexDZ013"},{"$f":"'Upload AXI - CONF'!C9","v":"object.DZAV.FlexDZ014"},{"$f":"'Upload AXI - CONF'!C10","v":"object.DZAV.FlexDZ015"},{"$f":"'Upload AXI - CONF'!C11","v":"object.DZAV.FlexDZ018"},{"$f":"'Upload AXI - CONF'!C12","v":"object.DZAV.FlexDZ019"},{"$f":"'Upload AXI - CONF'!C13","v":"object.DZAV.FlexDZ020"},{"$f":"'Upload AXI - CONF'!C14","v":"object.DZAV.FlexDZ021"},{"$f":"'Upload AXI - CONF'!C15","v":"object.DZAV.FlexDZ022"},{"$f":"'Upload AXI - CONF'!C16","v":"object.DZAV.FlexDZ023"},{"$f":"'Upload AXI - CONF'!C17","v":"object.DZAV.FlexDZ024"},{"$f":"'Upload AXI - CONF'!C18","v":"object.DZAV.FlexDZ027"},{"$f":"'Upload AXI - CONF'!C19","v":"object.DZAV.FlexDZ028"},{"$f":"'Upload AXI - CONF'!C20","v":"object.DZAV.FlexDZ016"},{"$f":"'Upload AXI - CONF'!C21","v":"object.DZAV.FlexDZ017"},{"$f":"'Upload AXI - CONF'!C22","v":"object.DZAV.FlexDZ029"},{"$f":"'Upload AXI - CONF'!C23","v":"object.DZAV.FlexDZ030"},{"$f":"'Upload AXI - CONF'!C24","v":"object.DZAV.FlexDZ006"},{"$f":"'Upload AXI - CONF'!C25","v":"object.DZAV.FlexDZ007"},{"$f":"'Upload AXI - CONF'!C26","v":"object.DZAV.FlexDZ008"},{"$f":"'Upload AXI - CONF'!C27","v":"object.DZAV.FlexDZ009"},{"$f":"'Upload AXI - CONF'!C28","v":"object.DZAV.FlexDZ010"},{"$f":"'Upload AXI - CONF'!C29","v":"object.DZAV.FlexDZ011"},{"$f":"'Upload AXI - CONF'!C30","v":"object.DZAV.FlexDZ012"},{"$f":"'Upload AXI - CONF'!C31","v":"object.DZAV.FlexDZ026"},{"$f":"'Upload AXI - CONF'!C32","v":"object.DZAV.FlexDZ025"},{"$f":"'Upload AXI - CONF'!C33","v":""},{"$f":"'Upload AXI - CONF'!C34","v":""},{"$f":"'Upload AXI - CONF'!C35","v":""},{"$f":"'Upload AXI - CONF'!C36","v":""},{"$f":"'Upload AXI - CONF'!C37","v":""},{"$f":"'Upload AXI - CONF'!C38","v":""},{"$f":"'Upload AXI - CONF'!C39","v":""},{"$f":"'Upload AXI - CONF'!C40","v":""},{"$f":"'Upload AXI - CONF'!C41","v":""},{"$f":"'Upload AXI - CONF'!C42","v":""},{"$f":"'Upload AXI - CONF'!C43","v":""},{"$f":"'Upload AXI - CONF'!C44","v":""},{"$f":"'Upload AXI - CONF'!C45","v":""},{"$f":"'Upload AXI - CONF'!C46","v":""},{"$f":"'Upload AXI - CONF'!C47","v":""},{"$f":"'Upload AXI - CONF'!C48","v":""},{"$f":"'Upload AXI - CONF'!C49","v":""},{"$f":"'Upload AXI - CONF'!C50","v":""},{"$f":"'Upload AXI - CONF'!C51","v":""},{"$f":"'Upload AXI - CONF'!C52","v":""},{"$f":"'Upload AXI - CONF'!C53","v":""},{"$f":"'Upload AXI - CONF'!C54","v":""},{"$f":"'Upload AXI - CONF'!C55","v":""},{"$f":"'Upload AXI - CONF'!C56","v":""},{"$f":"'Upload AXI - CONF'!C57","v":""},{"$f":"'Upload AXI - CONF'!C58","v":""},{"$f":"'Upload AXI - CONF'!C59","v":""},{"$f":"'Upload AXI - CONF'!C60","v":""},{"$f":"'Upload AXI - CONF'!C61","v":""},{"$f":"'Upload AXI - CONF'!C62","v":""},{"$f":"'Upload AXI - CONF'!C63","v":""},{"$f":"'Upload AXI - CONF'!C64","v":""},{"$f":"'Upload AXI - CONF'!C65","v":""},{"$f":"'Upload AXI - CONF'!C66","v":""},{"$f":"'Upload AXI - CONF'!C67","v":""},{"$f":"'Upload AXI - CONF'!C68","v":""},{"$f":"'Upload AXI - CONF'!C69","v":""},{"$f":"'Upload AXI - CONF'!C70","v":""},{"$f":"'Upload AXI - CONF'!C71","v":""},{"$f":"'Upload AXI - CONF'!C72","v":""},{"$f":"'Upload AXI - CONF'!C73","v":""},{"$f":"'Upload AXI - CONF'!C74","v":""},{"$f":"'Upload AXI - CONF'!C75","v":""},{"$f":"'Upload AXI - CONF'!C76","v":""},{"$f":"'Upload AXI - CONF'!C77","v":""},{"$f":"'Upload AXI - CONF'!C78","v":""},{"$f":"'Upload AXI - CONF'!C79","v":""},{"$f":"'Upload AXI - CONF'!C80","v":""},{"$f":"'Upload AXI - CONF'!C81","v":""},{"$f":"'Upload AXI - CONF'!C82","v":""},{"$f":"'Upload AXI - CONF'!C83","v":""},{"$f":"'Upload AXI - CONF'!C84","v":""},{"$f":"'Upload AXI - CONF'!C85","v":""},{"$f":"'Upload AXI - CONF'!C86","v":""},{"$f":"'Upload AXI - CONF'!C87","v":""},{"$f":"'Upload AXI - CONF'!C88","v":""},{"$f":"'Upload AXI - CONF'!C89","v":""},{"$f":"'Upload AXI - CONF'!C90","v":""},{"$f":"'Upload AXI - CONF'!C91","v":""},{"$f":"'Upload AXI - CONF'!C92","v":""},{"$f":"'Upload AXI - CONF'!C93","v":0},{"$f":"'Upload AXI - CONF'!C94","v":0},{"$f":"'Upload AXI - CONF'!C95","v":0},{"$f":"'Upload AXI - CONF'!C96","v":0},{"$f":"'Upload AXI - CONF'!C97","v":0},{"$f":"'Upload AXI - CONF'!C98","v":0},{"$f":"'Upload AXI - CONF'!C99","v":0},{"$f":"'Upload AXI - CONF'!C100","v":0},{"$f":"'Upload AXI - CONF'!C101","v":0},{"$f":"'Upload AXI - CONF'!C102","v":0},{"$f":"'Upload AXI - CONF'!C103","v":0},{"$f":"'Upload AXI - CONF'!C104","v":0},{"$f":"'Upload AXI - CONF'!C105","v":0},{"$f":"'Upload AXI - CONF'!C106","v":0},{"$f":"'Upload AXI - CONF'!C107","v":0},{"$f":"'Upload AXI - CONF'!C108","v":0},{"$f":"'Upload AXI - CONF'!C109","v":0},{"$f":"'Upload AXI - CONF'!C110","v":0},{"$f":"'Upload AXI - CONF'!C111","v":0},{"$f":"'Upload AXI - CONF'!C112","v":0},{"$f":"'Upload AXI - CONF'!C113","v":0},{"$f":"'Upload AXI - CONF'!C114","v":0},{"$f":"'Upload AXI - CONF'!C115","v":0},{"$f":"'Upload AXI - CONF'!C116","v":0},{"$f":"'Upload AXI - CONF'!C117","v":0},{"$f":"'Upload AXI - CONF'!C118","v":0},{"$f":"'Upload AXI - CONF'!C119","v":0},{"$f":"'Upload AXI - CONF'!C120","v":0},{"$f":"'Upload AXI - CONF'!C121","v":0},{"$f":"'Upload AXI - CONF'!C122","v":0},{"$f":"'Upload AXI - CONF'!C123","v":0},{"$f":"'Upload AXI - CONF'!C124","v":0},{"$f":"'Upload AXI - CONF'!C125","v":0},{"$f":"'Upload AXI - CONF'!C126","v":0},{"$f":"'Upload AXI - CONF'!C127","v":0},{"$f":"'Upload AXI - CONF'!C128","v":0},{"$f":"'Upload AXI - CONF'!C129","v":0},{"$f":"'Upload AXI - CONF'!C130","v":0},{"$f":"'Upload AXI - CONF'!C131","v":0}]
[{"$f":"'Upload AXI - CONF'!D2","v":0},{"$f":"'Upload AXI - CONF'!D3","v":0},{"$f":"'Upload AXI - CONF'!D4","v":0},{"$f":"'Upload AXI - CONF'!D5","v":0},{"$f":"'Upload AXI - CONF'!D6","v":""},{"$f":"'Upload AXI - CONF'!D7","v":""},{"$f":"'Upload AXI - CONF'!D8","v":""},{"$f":"'Upload AXI - CONF'!D9","v":""},{"$f":"'Upload AXI - CONF'!D10","v":""},{"$f":"'Upload AXI - CONF'!D11","v":"nee"},{"$f":"'Upload AXI - CONF'!D12","v":""},{"$f":"'Upload AXI - CONF'!D13","v":"nee"},{"$f":"'Upload AXI - CONF'!D14","v":"nee"},{"$f":"'Upload AXI - CONF'!D15","v":""},{"$f":"'Upload AXI - CONF'!D16","v":"0"},{"$f":"'Upload AXI - CONF'!D17","v":"Klik of tik om tekst in te voeren."},{"$f":"'Upload AXI - CONF'!D18","v":"nee"},{"$f":"'Upload AXI - CONF'!D19","v":""},{"$f":"'Upload AXI - CONF'!D20","v":"Kies een item."},{"$f":"'Upload AXI - CONF'!D21","v":"Kies een item."},{"$f":"'Upload AXI - CONF'!D22","v":"nee"},{"$f":"'Upload AXI - CONF'!D23","v":0},{"$f":"'Upload AXI - CONF'!D24","v":"nee"},{"$f":"'Upload AXI - CONF'!D25","v":"nee"},{"$f":"'Upload AXI - CONF'!D26","v":"nee"},{"$f":"'Upload AXI - CONF'!D27","v":"nee"},{"$f":"'Upload AXI - CONF'!D28","v":"nee"},{"$f":"'Upload AXI - CONF'!D29","v":"nee"},{"$f":"'Upload AXI - CONF'!D30","v":"nee"},{"$f":"'Upload AXI - CONF'!D31","v":""},{"$f":"'Upload AXI - CONF'!D32","v":"nee"},{"$f":"'Upload AXI - CONF'!D33","v":0},{"$f":"'Upload AXI - CONF'!D34","v":0},{"$f":"'Upload AXI - CONF'!D35","v":0},{"$f":"'Upload AXI - CONF'!D36","v":""},{"$f":"'Upload AXI - CONF'!D37","v":""},{"$f":"'Upload AXI - CONF'!D38","v":""},{"$f":"'Upload AXI - CONF'!D39","v":""},{"$f":"'Upload AXI - CONF'!D40","v":""},{"$f":"'Upload AXI - CONF'!D41","v":"nee"},{"$f":"'Upload AXI - CONF'!D42","v":""},{"$f":"'Upload AXI - CONF'!D43","v":"nee"},{"$f":"'Upload AXI - CONF'!D44","v":"nee"},{"$f":"'Upload AXI - CONF'!D45","v":""},{"$f":"'Upload AXI - CONF'!D46","v":"0"},{"$f":"'Upload AXI - CONF'!D47","v":"Klik of tik om tekst in te voeren."},{"$f":"'Upload AXI - CONF'!D48","v":"nee"},{"$f":"'Upload AXI - CONF'!D49","v":""},{"$f":"'Upload AXI - CONF'!D50","v":"Kies een item."},{"$f":"'Upload AXI - CONF'!D51","v":"Kies een item."},{"$f":"'Upload AXI - CONF'!D52","v":"nee"},{"$f":"'Upload AXI - CONF'!D53","v":0},{"$f":"'Upload AXI - CONF'!D54","v":"nee"},{"$f":"'Upload AXI - CONF'!D55","v":"nee"},{"$f":"'Upload AXI - CONF'!D56","v":"nee"},{"$f":"'Upload AXI - CONF'!D57","v":"nee"},{"$f":"'Upload AXI - CONF'!D58","v":"nee"},{"$f":"'Upload AXI - CONF'!D59","v":"nee"},{"$f":"'Upload AXI - CONF'!D60","v":"nee"},{"$f":"'Upload AXI - CONF'!D61","v":""},{"$f":"'Upload AXI - CONF'!D62","v":"nee"},{"$f":"'Upload AXI - CONF'!D63","v":0},{"$f":"'Upload AXI - CONF'!D64","v":0},{"$f":"'Upload AXI - CONF'!D65","v":0},{"$f":"'Upload AXI - CONF'!D66","v":""},{"$f":"'Upload AXI - CONF'!D67","v":""},{"$f":"'Upload AXI - CONF'!D68","v":""},{"$f":"'Upload AXI - CONF'!D69","v":""},{"$f":"'Upload AXI - CONF'!D70","v":""},{"$f":"'Upload AXI - CONF'!D71","v":"nee"},{"$f":"'Upload AXI - CONF'!D72","v":""},{"$f":"'Upload AXI - CONF'!D73","v":"nee"},{"$f":"'Upload AXI - CONF'!D74","v":"nee"},{"$f":"'Upload AXI - CONF'!D75","v":""},{"$f":"'Upload AXI - CONF'!D76","v":"0"},{"$f":"'Upload AXI - CONF'!D77","v":"Klik of tik om tekst in te voeren."},{"$f":"'Upload AXI - CONF'!D78","v":"nee"},{"$f":"'Upload AXI - CONF'!D79","v":""},{"$f":"'Upload AXI - CONF'!D80","v":"Kies een item."},{"$f":"'Upload AXI - CONF'!D81","v":"Kies een item."},{"$f":"'Upload AXI - CONF'!D82","v":"nee"},{"$f":"'Upload AXI - CONF'!D83","v":0},{"$f":"'Upload AXI - CONF'!D84","v":"nee"},{"$f":"'Upload AXI - CONF'!D85","v":"nee"},{"$f":"'Upload AXI - CONF'!D86","v":"nee"},{"$f":"'Upload AXI - CONF'!D87","v":"nee"},{"$f":"'Upload AXI - CONF'!D88","v":"nee"},{"$f":"'Upload AXI - CONF'!D89","v":"nee"},{"$f":"'Upload AXI - CONF'!D90","v":"nee"},{"$f":"'Upload AXI - CONF'!D91","v":""},{"$f":"'Upload AXI - CONF'!D92","v":"nee"},{"$f":"'Upload AXI - CONF'!D93","v":0},{"$f":"'Upload AXI - CONF'!D94","v":0},{"$f":"'Upload AXI - CONF'!D95","v":0},{"$f":"'Upload AXI - CONF'!D96","v":0},{"$f":"'Upload AXI - CONF'!D97","v":0},{"$f":"'Upload AXI - CONF'!D98","v":0},{"$f":"'Upload AXI - CONF'!D99","v":0},{"$f":"'Upload AXI - CONF'!D100","v":0},{"$f":"'Upload AXI - CONF'!D101","v":0},{"$f":"'Upload AXI - CONF'!D102","v":0},{"$f":"'Upload AXI - CONF'!D103","v":0},{"$f":"'Upload AXI - CONF'!D104","v":0},{"$f":"'Upload AXI - CONF'!D105","v":0},{"$f":"'Upload AXI - CONF'!D106","v":0},{"$f":"'Upload AXI - CONF'!D107","v":0},{"$f":"'Upload AXI - CONF'!D108","v":0},{"$f":"'Upload AXI - CONF'!D109","v":0},{"$f":"'Upload AXI - CONF'!D110","v":0},{"$f":"'Upload AXI - CONF'!D111","v":0},{"$f":"'Upload AXI - CONF'!D112","v":0},{"$f":"'Upload AXI - CONF'!D113","v":0},{"$f":"'Upload AXI - CONF'!D114","v":0},{"$f":"'Upload AXI - CONF'!D115","v":0},{"$f":"'Upload AXI - CONF'!D116","v":0},{"$f":"'Upload AXI - CONF'!D117","v":0},{"$f":"'Upload AXI - CONF'!D118","v":0},{"$f":"'Upload AXI - CONF'!D119","v":0},{"$f":"'Upload AXI - CONF'!D120","v":0},{"$f":"'Upload AXI - CONF'!D121","v":0},{"$f":"'Upload AXI - CONF'!D122","v":0},{"$f":"'Upload AXI - CONF'!D123","v":0},{"$f":"'Upload AXI - CONF'!D124","v":0},{"$f":"'Upload AXI - CONF'!D125","v":0},{"$f":"'Upload AXI - CONF'!D126","v":0},{"$f":"'Upload AXI - CONF'!D127","v":0},{"$f":"'Upload AXI - CONF'!D128","v":0},{"$f":"'Upload AXI - CONF'!D129","v":0},{"$f":"'Upload AXI - CONF'!D130","v":0},{"$f":"'Upload AXI - CONF'!D131","v":0}]

{"sheet":"Bron","index":9,"n_rows":8,"n_cols":2,"rows_kept":8,"cut":false,"hidden":true,"merged":[]}
[]
["Score","Uitstekend"]
[null,"Beter"]
[null,"Goed"]
[null,"Matig"]
[]
[null,"Voldaan"]
[null,"Niet voldaan"]